Target
Guanine nucleotide-binding protein subunit alpha-15
Ligand
BDBM96885
Substrate
IC50
>29870±n/a nM
Citation
 PubChem, PC Counterscreen for agonists of the human trace amine associated receptor 1 (TAAR1): Fluorescence-based cell-based high throughput dose response assay to identify nonselective Ga16 antagonists PubChem Bioassay (2013)[AID] 
Target
Name:
Guanine nucleotide-binding protein subunit alpha-15
Synonyms:
G-protein subunit alpha-16 GNA15 GNA16 | guanine nucleotide-binding protein subunit alpha-15
Type:
Protein
Mol. Mass.:
43577.62
Organism:
Homo sapiens (Human)
Description:
P30679
Residue:
374
  
Inhibitor
Name:
BDBM96885
Synonyms:
(2S)-N-[2-(2-chlorophenyl)ethyl]-1-[(2S)-2-[(3,4-dichlorobenzoyl)amino]-3-methyl-butanoyl]pyrrolidine-2-carboxamide (2S)-N-[2-(2-chlorophenyl)ethyl]-1-[(2S)-2-[(3,4-dichlorophenyl)carbonylamino]-3-methyl-butanoyl]pyrrolidine-2-carboxamide MLS003777924 cid_53361926
Type:
Small organic molecule
Emp. Form.:
C25H28Cl3N3O3
Mol. Mass.:
524.867
SMILES:
CC(C)[C@H](NC(=O)c1ccc(Cl)c(Cl)c1)C(=O)N1CCC[C@H]1C(=O)NCCc1ccccc1Cl
: