Target
Fatty-acid amide hydrolase 1 [30-579]
Ligand
BDBM97462
Substrate
Meas. Tech.
FAAH Inhibition Assay
IC50
1029±337 nM
Citation
 Tarzia, GDuranti, AGatti, GPiersanti, GTontini, ARivara, SLodola, APlazzi, PVMor, MKathuria, SPiomelli, D Synthesis and structure-activity relationships of FAAH inhibitors: cyclohexylcarbamic acid biphenyl esters with chemical modulation at the proximal phenyl ring. ChemMedChem 1:130-9 (2006)  
Target
Name:
Fatty-acid amide hydrolase 1 [30-579]
Synonyms:
Anandamide amidohydrolase 1 Faah Fatty Acid Amide Hydrolase Fatty-acid amide hydrolase (FAAH) Fatty-acid amide hydrolase 1 (FAAH) Oleamide hydrolase 1
Type:
Single-pass membrane protein; homodimer
Mol. Mass.:
60474.00
Organism:
Rattus norvegicus (rat)
Description:
P97612 (aa 30-579)
Residue:
550
  
Inhibitor
Name:
BDBM97462
Synonyms:
FAAH Inhibitor, 2k
Type:
Small molecule
Emp. Form.:
C21H22N2O2
Mol. Mass.:
334.4116
SMILES:
O=C(NC1CCCCC1)Oc1ccc2ccn(-c3ccccc3)c2c1
: