Target
Dual specificity mitogen-activated protein kinase kinase 1 [2-31,52-393,S218E,S222D]
Ligand
BDBM1716
Substrate
Meas. Tech.
Enzyme Assay
pH
7.3±n/a
Temperature
298.15±n/a K
IC50
10±n/a nM
Comments
extracted
Citation
 Dong, QKaldor, SW MAPK/ERK kinase inhibitors US Patent  US8470837 Publication Date 6/25/2013 
Target
Name:
Dual specificity mitogen-activated protein kinase kinase 1 [2-31,52-393,S218E,S222D]
Synonyms:
Dual specificity mitogen-activated protein kinase kinase 1 MEK1 PRKMK1
Type:
Protein
Mol. Mass.:
40898.07
Organism:
Homo sapiens (Human)
Description:
Q02750[2-31,52-393,S218E,S222D]
Residue:
372
  
Inhibitor
Name:
BDBM1716
Synonyms:
CHEMBL1684072 | US8470837, 17
Type:
Emp. Form.:
C16H13F2IN4O3
Mol. Mass.:
474.2007
SMILES:
Cn1c2ncn(CCO)c(=O)c2c(Nc2ccc(I)cc2F)c(F)c1=O
: