Target
Dual specificity mitogen-activated protein kinase kinase 1 [2-31,52-393,S218E,S222D]
Ligand
BDBM97650
Substrate
Meas. Tech.
Enzyme Assay
pH
7.3±0
Temperature
298.15±0 K
IC50
10±5 nM
Citation
 Dong, QKaldor, SW MAPK/ERK kinase inhibitors US Patent  US8470837 Publication Date 6/25/2013 
Target
Name:
Dual specificity mitogen-activated protein kinase kinase 1 [2-31,52-393,S218E,S222D]
Synonyms:
Dual specificity mitogen-activated protein kinase kinase 1 MEK1 PRKMK1
Type:
Protein
Mol. Mass.:
40898.07
Organism:
Homo sapiens (Human)
Description:
Q02750[2-31,52-393,S218E,S222D]
Residue:
372
  
Inhibitor
Name:
BDBM97650
Synonyms:
US8470837, 29
Type:
Small organic molecule
Emp. Form.:
C17H15BrClFN4O4
Mol. Mass.:
473.681
SMILES:
Cn1c2ncn(C[C@@H](O)CO)c(=O)c2c(Nc2ccc(Br)cc2F)c(Cl)c1=O
: