Target
Tyrosine-protein kinase BTK
Ligand
BDBM1773
Substrate
Meas. Tech.
In Vitro Inhibition Assay
pH
7.4±0
IC50
0.72±0.0 nM
Citation
 Honigberg, LVerner, EPan, Z Inhibitors of Bruton's tyrosine kinase US Patent  US8476284 Publication Date 7/2/2013 
Target
Name:
Tyrosine-protein kinase BTK
Synonyms:
AGMX1 Agammaglobulinaemia tyrosine kinase B cell progenitor kinase BPK BTK_HUMAN Tyrosine Kinase BTK Tyrosine-protein kinase BTK (BTK)
Type:
Enzyme
Mol. Mass.:
76289.95
Organism:
Homo sapiens (Human)
Description:
Q06187
Residue:
659
  
Inhibitor
Name:
BDBM1773
Synonyms:
US10280174, Comparative Compound 1 US8497277, 13 US9133201, 13 US9133201, 4 | US9975882, comparative compound A
Type:
Emp. Form.:
C25H24N6O2
Mol. Mass.:
440.4971
SMILES:
Nc1ncnc2n(nc(-c3ccc(Oc4ccccc4)cc3)c12)C1CCCN(C1)C(=O)C=C
: