Target
Macrophage colony-stimulating factor 1
Ligand
BDBM97728
Substrate
Meas. Tech.
Fluorescence Polarization Competition Immunoassay
pH
7.5±0
IC50
1±n/a nM
Citation
 Illig, CRBallentine, SKChen, JDesJarlais, RLMeegalla, SKWall, MWilson, K Inhibitors of c-fms kinase US Patent  US8481564 Publication Date 7/9/2013 
Target
Name:
Macrophage colony-stimulating factor 1
Synonyms:
CSF1_MOUSE Csfm | Macrophage colony-stimulating factor 1 (CSF-1)
Type:
Protein
Mol. Mass.:
60631.84
Organism:
Mus musculus (Mouse)
Description:
P07141
Residue:
552
  
Inhibitor
Name:
BDBM97728
Synonyms:
US8481564, 3
Type:
Small organic molecule
Emp. Form.:
C24H25N5O3
Mol. Mass.:
431.487
SMILES:
CC1(C)CCC(=CC1)c1cc(ccc1NC(=O)c1nc(c[nH]1)C#N)C1CC(=O)NC(=O)C1
: