Target
Activin receptor type-1B
Ligand
BDBM280346
Substrate
Meas. Tech.
In Vitro Kinase Assay Inhibition of ALK1/2/3/4/5/6 Kinases
IC50
23.5±n/a nM
Citation
 Rai, RChakravarty, SPujala, BShinde, BUNayak, AKChaklan, NAgarwal, AKRamachandran, SAPham, SM Compounds and methods of use US Patent  US10030004 Publication Date 7/24/2018 
Target
Name:
Activin receptor type-1B
Synonyms:
ACV1B_HUMAN ACVRLK4 Activin receptor type-1B/Activin receptor-like kinase 4 (ALK-4)
Type:
PROTEIN
Mol. Mass.:
56810.99
Organism:
Homo sapiens (Human)
Description:
ChEMBL_587064
Residue:
505
  
Inhibitor
Name:
BDBM280346
Synonyms:
4-[[2-(5-chloro-2-fluoro-phenyl)-5-methoxy-4-pyridyl]amino]-N-[(2S)-2-hydroxypropyl]pyridine-3-carboxamide US10501436, Compound 13a US11702401, Compound 13a
Type:
Small organic molecule
Emp. Form.:
C21H20ClFN4O3
Mol. Mass.:
430.86
SMILES:
COc1cnc(cc1Nc1ccncc1C(=O)NC[C@H](C)O)-c1cc(Cl)ccc1F
: