Target
Monoacylglycerol lipase ABHD2
Ligand
BDBM280558
Substrate
Meas. Tech.
In Vitro Competitive Activity-Based Protein Profiling
IC50
550±n/a nM
Citation
 Cisar, JSGrice, CAJones, TKWeber, ODBuzard, DJShaghafi, MB Spirocycle compounds and methods of making and using same US Patent  US10030020 Publication Date 7/24/2018 
Target
Name:
Monoacylglycerol lipase ABHD2
Synonyms:
2-arachidonoylglycerol hydrolase Abhd2 Labh-2 Lung alpha/beta hydrolase 2 | MmLABH2
Type:
Enzyme Catalytic Domain
Mol. Mass.:
48378.90
Organism:
Mus musculus (Mouse)
Description:
Residue:
425
  
Inhibitor
Name:
BDBM280558
Synonyms:
US10030020, Example 103 | US10781211, Example 103
Type:
Small organic molecule
Emp. Form.:
C23H28ClF6N3O4S
Mol. Mass.:
591.995
SMILES:
FC(F)(F)C(OC(=O)N1CCC2(CCCN2Cc2ccc(Cl)cc2N2CCS(=O)(=O)CC2)CC1)C(F)(F)F
: