Target
Monoacylglycerol lipase ABHD2
Ligand
BDBM280574
Substrate
Meas. Tech.
In Vitro Competitive Activity-Based Protein Profiling
IC50
550±n/a nM
Citation
 Cisar, JSGrice, CAJones, TKWeber, ODBuzard, DJShaghafi, MB Spirocycle compounds and methods of making and using same US Patent  US10030020 Publication Date 7/24/2018 
Target
Name:
Monoacylglycerol lipase ABHD2
Synonyms:
2-arachidonoylglycerol hydrolase Abhd2 Labh-2 Lung alpha/beta hydrolase 2 | MmLABH2
Type:
Enzyme Catalytic Domain
Mol. Mass.:
48378.90
Organism:
Mus musculus (Mouse)
Description:
Residue:
425
  
Inhibitor
Name:
BDBM280574
Synonyms:
BDBM280666 US10781211, Example 119
Type:
Small organic molecule
Emp. Form.:
C26H30F9N3O4
Mol. Mass.:
619.5197
SMILES:
OC(=O)C1CCN(CC1)c1cc(ccc1CN1CCC2(C1)CCN(CC2)C(=O)OC(C(F)(F)F)C(F)(F)F)C(F)(F)F
: