Target
Monoglyceride lipase
Ligand
BDBM280579
Substrate
Meas. Tech.
In Vitro Competitive Activity-Based Protein Profiling
IC50
<100±n/a nM
Citation
 Cisar, JSGrice, CAJones, TKWeber, ODBuzard, DJShaghafi, MB Spirocycle compounds and methods of making and using same US Patent  US10030020 Publication Date 7/24/2018 
Target
Name:
Monoglyceride lipase
Synonyms:
MAG lipase Mgll Monoglyceride Lipase (MGL)
Type:
Hydrolase
Mol. Mass.:
33391.67
Organism:
Mus musculus (mouse)
Description:
Assays were using membranes of recombinant MAG Lipase transiently transfected in COS-7 cells.
Residue:
303
  
Inhibitor
Name:
BDBM280579
Synonyms:
US10030020, Example 124 | US10781211, Example 124
Type:
Small organic molecule
Emp. Form.:
C20H23ClF6N2O2
Mol. Mass.:
472.852
SMILES:
Cc1cc(CN2CCCC22CCN(CC2)C(=O)OC(C(F)(F)F)C(F)(F)F)ccc1Cl
: