Target
Monoacylglycerol lipase ABHD2
Ligand
BDBM280601
Substrate
Meas. Tech.
In Vitro Competitive Activity-Based Protein Profiling
IC50
>1000±n/a nM
Citation
 Cisar, JSGrice, CAJones, TKWeber, ODBuzard, DJShaghafi, MB Spirocycle compounds and methods of making and using same US Patent  US10030020 Publication Date 7/24/2018 
Target
Name:
Monoacylglycerol lipase ABHD2
Synonyms:
2-arachidonoylglycerol hydrolase Abhd2 Labh-2 Lung alpha/beta hydrolase 2 | MmLABH2
Type:
Enzyme Catalytic Domain
Mol. Mass.:
48378.90
Organism:
Mus musculus (Mouse)
Description:
Residue:
425
  
Inhibitor
Name:
BDBM280601
Synonyms:
US10030020, Example 146 | US10781211, Example 146
Type:
Small organic molecule
Emp. Form.:
C23H29F6N3O4S
Mol. Mass.:
557.549
SMILES:
CS(=O)(=O)N1CCc2cccc(CN3CCCC33CCN(CC3)C(=O)OC(C(F)(F)F)C(F)(F)F)c2C1
: