Target
Mu-type opioid receptor
Ligand
BDBM4249
Substrate
Meas. Tech.
Binding Assay
Ki
29.57±0 nM
Citation
 Kyle, DJGoehring, RRFundytus, ME Buprenophine analogs US Patent  US8530494 Publication Date 9/10/2013 
Target
Name:
Mu-type opioid receptor
Synonyms:
M-OR-1 MOR-1 MUOR1 Mu opiate receptor OPRM1 hMOP | mu-type opioid receptor isoform MOR-1
Type:
G Protein-Coupled Receptor (GPCR)
Mol. Mass.:
44789.51
Organism:
Homo sapiens (Human)
Description:
P35372
Residue:
400
  
Inhibitor
Name:
BDBM4249
Synonyms:
US8530494, 50
Type:
Emp. Form.:
C27H37NO4
Mol. Mass.:
439.587
SMILES:
COc1ccc2C[C@H]3N(C)CC[C@@]45[C@@H](Oc1c24)[C@]1(CC[C@@]35C[C@@H]1COCC1CCC1)OC
: