Target
Kappa-type opioid receptor
Ligand
BDBM4362
Substrate
Meas. Tech.
Binding Assay
Ki
0.21±0 nM
Citation
 Kyle, DJGoehring, RRFundytus, ME Buprenophine analogs US Patent  US8530494 Publication Date 9/10/2013 
Target
Name:
Kappa-type opioid receptor
Synonyms:
K-OR-1 Kappa-opioid receptor (KOR) Kappa-type opioid receptor (KOR) OPIATE Kappa OPRK1 kappa opioid receptor (KOR)
Type:
G Protein-Coupled Receptor (GPCR)
Mol. Mass.:
42648.76
Organism:
Homo sapiens (Human)
Description:
P41145
Residue:
380
  
Inhibitor
Name:
BDBM4362
Synonyms:
US8530494, 215
Type:
Emp. Form.:
C30H37NO5
Mol. Mass.:
491.6185
SMILES:
COc1cccc(COC[C@H]2C[C@]34CC[C@]2(OC)[C@@H]2Oc5c6c(C[C@H]3N(C)CC[C@@]426)ccc5OC)c1
: