Target
Isoform 3 of Acetyl-CoA carboxylase 2 (ACC2.v2)
Ligand
BDBM101974
Substrate
Meas. Tech.
Enzyme Assay
IC50
4e+1±n/a nM
Citation
 Fleck, MNosse, BHeine, NRoth, GJ Azetidine derivatives US Patent  US8530460 Publication Date 9/10/2013 
Target
Name:
Isoform 3 of Acetyl-CoA carboxylase 2 (ACC2.v2)
Synonyms:
ACACB ACC2 Acetyl-CoA carboxylase 2 (ACC2) | Acetyl-CoA carboxylase 2 (ACC2.v2)
Type:
Protein
Mol. Mass.:
255085.30
Organism:
Homo sapiens (Human)
Description:
AJ575592.3
Residue:
2256
  
Inhibitor
Name:
BDBM101974
Synonyms:
US8530460, 1.54
Type:
Small organic molecule
Emp. Form.:
C23H25F3N2O3
Mol. Mass.:
434.4514
SMILES:
C[C@H](NC(C)=O)c1ccc(OC2CN(C2)c2ccc(OCC3CC3(F)F)cc2F)cc1
: