Target
Serine/threonine-protein kinase receptor R3
Ligand
BDBM102618
Substrate
IC50
2.4±0.0 nM
Citation
 Mohedas, AHXing, XArmstrong, KABullock, ANCuny, GDYu, PB Development of an ALK2-Biased BMP Type I Receptor Kinase Inhibitor. ACS Chem Biol 8:1291-302 (2013)  
Target
Name:
Serine/threonine-protein kinase receptor R3
Synonyms:
ACVL1_MOUSE AI427544 Acvrl1 Alk-1
Type:
Protein
Mol. Mass.:
56529.91
Organism:
Mus musculus
Description:
Residue:
502
  
Inhibitor
Name:
BDBM102618
Synonyms:
LDN-212854
Type:
Small organic molecule
Emp. Form.:
C25H22N6
Mol. Mass.:
406.4824
SMILES:
C1CN(CCN1)c1ccc(cc1)-c1cnc2c(cnn2c1)-c1cccc2ncccc12
: