Target
Genome polyprotein
Ligand
BDBM103270
Substrate
Meas. Tech.
Inhibition Assay
IC50
1.0e+2±n/a nM
Citation
 Halim, RHarding, MHufton, RMorton, CJJahangiri, SPool, BRJeynes, TPDraffan, AGFrey, BLilly, MJ Viral polymerase inhibitors US Patent  US8546389 Publication Date 10/1/2013 
Target
Name:
Genome polyprotein
Synonyms:
Genome polyprotein POLG_HCVBK | RNA-directed RNA polymerase (NS5B)
Type:
Protein
Mol. Mass.:
327252.46
Organism:
Hepatitis C virus genotype 1b (isolate BK) (HCV)
Description:
P26663
Residue:
3010
  
Inhibitor
Name:
BDBM103270
Synonyms:
US8546389, 175
Type:
Small organic molecule
Emp. Form.:
C21H23ClN4O3S
Mol. Mass.:
446.95
SMILES:
CCN(c1cc2nn(c(C(=O)NC)c2cc1C1CC1)-c1ccc(Cl)cc1)S(C)(=O)=O
: