Target
Genome polyprotein
Ligand
BDBM103255
Substrate
Meas. Tech.
Inhibition Assay
IC50
2e+1±n/a nM
Citation
 Halim, RHarding, MHufton, RMorton, CJJahangiri, SPool, BRJeynes, TPDraffan, AGFrey, BLilly, MJ Viral polymerase inhibitors US Patent  US8546389 Publication Date 10/1/2013 
Target
Name:
Genome polyprotein
Synonyms:
HCV NS5B Polymerase RNA-directed RNA polymerase (NS5B)
Type:
Protein
Mol. Mass.:
329637.29
Organism:
Hepatitis C virus genotype 3a (isolate NZL1) (HCV)
Description:
Q81258
Residue:
3021
  
Inhibitor
Name:
BDBM103255
Synonyms:
US8546389, 22
Type:
Small organic molecule
Emp. Form.:
C27H28FN5O3S
Mol. Mass.:
521.606
SMILES:
CCN(c1cc2nn(c(C(=O)NC)c2cc1C1CC1)-c1ccc(Nc2ccc(F)cc2)cc1)S(C)(=O)=O
: