Target
Histone deacetylase 8
Ligand
BDBM1015
Substrate
Meas. Tech.
Enzyme Assay
IC50
345±n/a nM
Citation
 Chen, DSong, HYSun, ETYu, NZou, Y Benzimidazole derivatives: preparation and pharmaceutical applications US Patent  US8551988 Publication Date 10/8/2013 
Target
Name:
Histone deacetylase 8
Synonyms:
HD8 HDAC8_HUMAN Histone deacetylase 8 (HDAC-8) | Human HDAC8
Type:
Enzyme
Mol. Mass.:
41749.60
Organism:
Homo sapiens (Human)
Description:
Q9BY41
Residue:
377
  
Inhibitor
Name:
BDBM1015
Synonyms:
US8551988, 42 | US8551988, 44
Type:
Emp. Form.:
C24H30N4O3
Mol. Mass.:
422.52
SMILES:
ONC(=O)\C=C\c1ccc2N(CCN3CCOCC3)C(CCc3ccccc3)Nc2c1
: