Target
Serine/threonine-protein kinase B-raf [V600E]
Ligand
BDBM103686
Substrate
Meas. Tech.
Raf/Mek Amplified Luminescence Proximity Homogeneous Assay
pH
7.5±0
IC50
0.22±n/a nM
Citation
 Costales, AQHuang, SJin, JXLiu, ZPecchi, SPoon, DTellew, J Compounds and compositions as protein kinase inhibitors US Patent  US8563553 Publication Date 10/22/2013 
Target
Name:
Serine/threonine-protein kinase B-raf [V600E]
Synonyms:
B-RAF V600E B-Raf Protein Kinase Mutant (V600E) BRAF BRAF mutant V600E BRAF_HUMAN Protein mono-ADP-ribosyltransferase (PARP3) RAFB1 Serine/threonine-protein kinase B-raf (V600E) V-RAF murine sarcoma viral oncogene homologue B1 mutant (BRAF V600E)
Type:
Mol. Mass.:
84474.98
Organism:
Homo sapiens (Human)
Description:
P15056 V600E
Residue:
766
  
Inhibitor
Name:
BDBM103686
Synonyms:
US8563553, 111
Type:
Small organic molecule
Emp. Form.:
C23H21ClF2N6O2S
Mol. Mass.:
518.967
SMILES:
CC(C)(C)c1nc(c([nH]1)-c1cccc(NS(=O)(=O)c2c(F)cccc2F)c1Cl)-c1ccnc(N)n1
: