Target
Muscarinic acetylcholine receptor M3
Ligand
BDBM103744
Substrate
Meas. Tech.
Radioligand Binding Assay
Ki
0.1±0.0 nM
Citation
 Hughes, ADChen, YJacobsen, JRStangeland, ELYen, R Diamide compounds having muscarinic receptor antagonist and β2 adrenergic receptor agonist activity US Patent  US8551978 Publication Date 10/8/2013 
Target
Name:
Muscarinic acetylcholine receptor M3
Synonyms:
ACM3_HUMAN Cholinergic, muscarinic M3 Muscarinic receptor M3 | RecName: Full=Muscarinic acetylcholine receptor M3
Type:
Enzyme
Mol. Mass.:
66151.03
Organism:
Homo sapiens (Human)
Description:
P20309
Residue:
590
  
Inhibitor
Name:
BDBM103744
Synonyms:
US8551978, I-9 US9394275, I-9 US9682957, I-9
Type:
Small organic molecule
Emp. Form.:
C46H54N6O8
Mol. Mass.:
818.9564
SMILES:
COc1ccc(NC(=O)CCCN(C)C(=O)CCN2CCC(CC2)OC(=O)Nc2ccccc2-c2ccccc2)cc1CCNC[C@H](O)c1ccc(O)c2[nH]c(=O)ccc12
: