Target
Muscarinic acetylcholine receptor M3
Ligand
BDBM103748
Substrate
Meas. Tech.
Radioligand Binding Assay
Ki
0.1±0.0 nM
Citation
 Hughes, ADChen, YJacobsen, JRStangeland, ELYen, R Diamide compounds having muscarinic receptor antagonist and β2 adrenergic receptor agonist activity US Patent  US8551978 Publication Date 10/8/2013 
Target
Name:
Muscarinic acetylcholine receptor M3
Synonyms:
ACM3_HUMAN Cholinergic, muscarinic M3 Muscarinic receptor M3 | RecName: Full=Muscarinic acetylcholine receptor M3
Type:
Enzyme
Mol. Mass.:
66151.03
Organism:
Homo sapiens (Human)
Description:
P20309
Residue:
590
  
Inhibitor
Name:
BDBM103748
Synonyms:
US8551978, I-15 US9572802, Compound I-15 | US9682957, I-15
Type:
Small organic molecule
Emp. Form.:
C46H54N6O7
Mol. Mass.:
802.957
SMILES:
CN(CCCCC(=O)Nc1ccc(CNC[C@H](O)c2ccc(O)c3[nH]c(=O)ccc23)cc1C)C(=O)CCN1CCC(CC1)OC(=O)Nc1ccccc1-c1ccccc1
: