Target
Muscarinic acetylcholine receptor M3
Ligand
BDBM103751
Substrate
Meas. Tech.
Radioligand Binding Assay
Ki
0.1±0.0 nM
Citation
 Hughes, ADChen, YJacobsen, JRStangeland, ELYen, R Diamide compounds having muscarinic receptor antagonist and β2 adrenergic receptor agonist activity US Patent  US8551978 Publication Date 10/8/2013 
Target
Name:
Muscarinic acetylcholine receptor M3
Synonyms:
ACM3_HUMAN Cholinergic, muscarinic M3 Muscarinic receptor M3 | RecName: Full=Muscarinic acetylcholine receptor M3
Type:
Enzyme
Mol. Mass.:
66151.03
Organism:
Homo sapiens (Human)
Description:
P20309
Residue:
590
  
Inhibitor
Name:
BDBM103751
Synonyms:
US8551978, I-19 US9394275, I-19 US9682957, I-19
Type:
Small organic molecule
Emp. Form.:
C46H53ClN6O8
Mol. Mass.:
853.401
SMILES:
COc1cc(NC(=O)CCCCN(C)C(=O)CCN2CCC(CC2)OC(=O)Nc2ccccc2-c2ccccc2)c(Cl)cc1CNC[C@H](O)c1ccc(O)c2[nH]c(=O)ccc12
: