Target
Amyloid-beta precursor protein
Ligand
BDBM103948
Substrate
Meas. Tech.
Pharmacological Assay
IC50
1±0.0 nM
Citation
 Asberom, TBara, TABennett, CEBurnett, DACaplen, MAClader, JWCole, DJDomalski, MSJosien, HBKnutson, CELi, HMcBriar, MDPissarnitski, DAQiang, LRajagopalan, MSasikumar, TKSu, JTang, HWu, WXu, RZhao, Z Benzenesulfonyl-chromane, thiochromane, tetrahydronaphthalene and related gamma secretase inhibitors US Patent  US8569521 Publication Date 10/29/2013 
Target
Name:
Amyloid-beta precursor protein
Synonyms:
A4 ABPP AICD-50 AICD-59 AID(57) APP Alzheimer disease amyloid protein Amyloid beta Protein Amyloid beta protein Abeta(1-42) Amyloid intracellular domain 57 Amyloid protein (Abeta42b) Beta amyloid A4 protein Beta-APP42 Beta-amyloid protein 42 C83 CVAP Gamma Secretase Gamma-CTF(57) Gamma-secretase Gamma-secretase C-terminal fragment 57 P3(40) PN-II Protease nexin-II S-APP-beta Soluble APP-beta | beta-Amyloid Precursor Protein (APP)
Type:
Single-pass type I membrane protein
Mol. Mass.:
86890.41
Organism:
Homo sapiens (Human)
Description:
P05067
Residue:
770
  
Inhibitor
Name:
BDBM103948
Synonyms:
US8569521, 144
Type:
Small organic molecule
Emp. Form.:
C22H24ClF2NO5S2
Mol. Mass.:
520.009
SMILES:
CCS(=O)(=O)NC[C@@H]1CCC[C@@]2([C@H]1COc1c(F)ccc(F)c21)S(=O)(=O)c1ccc(Cl)cc1
: