Target
Fucose-binding lectin PA-IIL
Ligand
BDBM103985
Substrate
IC50
3.726e+5± 9.01e+4 nM
Citation
 Hauck, DJoachim, IFrommeyer, BVarrot, APhilipp, BMöller, HMMöller, AExner, TETitz, A Discovery of two classes of potent glycomimetic inhibitors of Pseudomonas aeruginosa LecB with distinct binding modes. ACS Chem Biol 8:1775-84 (2013)  
Target
Name:
Fucose-binding lectin PA-IIL
Synonyms:
LecB | PA-IIL
Type:
Protein
Mol. Mass.:
11857.84
Organism:
Pseudomonas aeruginosa
Description:
Q9HYN5
Residue:
115
  
Inhibitor
Name:
BDBM103985
Synonyms:
LecB Inhibitor Triazoles 2c
Type:
Small organic molecule
Emp. Form.:
C15H19N3O5
Mol. Mass.:
321.3285
SMILES:
COC1O[C@H](Cn2cc(nn2)-c2ccccc2)[C@@H](O)C(O)[C@@H]1O
: