Target
Fucose-binding lectin PA-IIL
Ligand
BDBM103992
Substrate
IC50
7.58e+4± 1.58e+4 nM
Citation
 Hauck, DJoachim, IFrommeyer, BVarrot, APhilipp, BMöller, HMMöller, AExner, TETitz, A Discovery of two classes of potent glycomimetic inhibitors of Pseudomonas aeruginosa LecB with distinct binding modes. ACS Chem Biol 8:1775-84 (2013)  
Target
Name:
Fucose-binding lectin PA-IIL
Synonyms:
LecB | PA-IIL
Type:
Protein
Mol. Mass.:
11857.84
Organism:
Pseudomonas aeruginosa
Description:
Q9HYN5
Residue:
115
  
Inhibitor
Name:
BDBM103992
Synonyms:
LecB Inhibitor Amides 4c
Type:
Small organic molecule
Emp. Form.:
C14H19N2O8
Mol. Mass.:
343.3087
SMILES:
COC1O[C@H](CNC(=O)c2ccc(cc2)[N+](O)=O)[C@@H](O)C(O)[C@@H]1O
: