Target
3-phosphoinositide-dependent protein kinase 1
Ligand
BDBM50296949
Substrate
Meas. Tech.
AlphaScreen Assay
pH
7.4±n/a
Temperature
273.15±n/a K
IC50
9.7e+4±n/a nM
Citation
 Pastor-Flores, DSchulze, JOBahí, ABahí, RFerrer-Dalmau, JPasseron, SEngel, MSüss, ESüss, ABiondi, RM PIF-pocket as a target for C. albicans Pkh selective inhibitors. ACS Chem Biol 8:2283-92 (2013)  
Target
Name:
3-phosphoinositide-dependent protein kinase 1
Synonyms:
3-Phosphoinositide-Dependent Protein Kinase 1 (PDK1) 3-phosphoinositide-dependent protein kinase 1 3-phosphoinositide-dependent protein kinase 1 (PDK-1) Isoform 2 of 3-phosphoinositide-dependent protein kinase 1 PDPK1 Phosphoinositide-dependent protein kinase 1 (PDK1) hPDK1
Type:
Enzyme
Mol. Mass.:
63157.65
Organism:
Homo sapiens (Human)
Description:
O15530
Residue:
556
  
Inhibitor
Name:
BDBM50296949
Synonyms:
(2Z)-5-(4-chlorophenyl)-3-phenylpent-2-enoic acid (Z)-5-(4-chlorophenyl)-3-phenylpent-2-enoic acid PS48
Type:
Small organic molecule
Emp. Form.:
C17H15ClO2
Mol. Mass.:
286.753
SMILES:
OC(=O)\C=C(\CCc1ccc(Cl)cc1)c1ccccc1
: