Target
Androgen receptor
Ligand
BDBM104030
Substrate
Meas. Tech.
HDAC Activity Assay
Ki
4.4e+2±n/a nM
IC50
6.5e+2±n/a nM
Citation
 Gryder, BEAkbashev, MJRood, MKRaftery, EDMeyers, WMDillard, PKhan, SOyelere, AK Selectively targeting prostate cancer with antiandrogen equipped histone deacetylase inhibitors. ACS Chem Biol 8:2550-60 (2013)  
Target
Name:
Androgen receptor
Synonyms:
ANDR_HUMAN Androgen Receptor Androgen receptor/Baculoviral IAP repeat-containing protein 2 Dihydrotestosterone receptor Nuclear receptor subfamily 3 group C member 4
Type:
Receptor
Mol. Mass.:
99185.27
Organism:
Homo sapiens (Human)
Description:
CHO cells were stably transfected with human AR gene.
Residue:
920
  
Inhibitor
Name:
BDBM104030
Synonyms:
Aryl Nilutamide HDACi analog 14e
Type:
Small organic molecule
Emp. Form.:
C30H32F3N7O4
Mol. Mass.:
611.6148
SMILES:
CC1(C)N(Cc2ccc(cc2)-c2cn(CCCCCCCC(=O)NO)nn2)C(=O)N(C1=O)c1ccc(C#N)c(c1)C(F)(F)F
: