Target
Serine/threonine-protein kinase pim-1
Ligand
BDBM104215
Substrate
Meas. Tech.
PIM-1 Enzyme Assay
pH
7.4±0
Temperature
295.15±0 K
IC50
1±0.0 nM
Citation
 Allen, SCeleste, LLDavis, TGDeLisle, RKGreschuk, JMGross, SDHicken, EJJackson, LJKallan, NCLyssikatos, JPMarmsater, FPMunson, MCPheneger, JRast, BRobinson, JESchlachter, STTopalov, GTWright, ADZhao, Q Triazolopyridine compounds as PIM kinase inhibitors US Patent  US8575145 Publication Date 11/5/2013 
Target
Name:
Serine/threonine-protein kinase pim-1
Synonyms:
PIM-1 Kinase PIM1_HUMAN Serine/threonine-protein kinase (PIM1) Serine/threonine-protein kinase PIM1 | Serine/threonine-protein kinase pim-1 (PIM1)
Type:
Protein
Mol. Mass.:
35681.82
Organism:
Homo sapiens (Human)
Description:
P11309
Residue:
313
  
Inhibitor
Name:
BDBM104215
Synonyms:
US8575145, 152 US8575145, 92/122
Type:
Small organic molecule
Emp. Form.:
C22H22FN5O
Mol. Mass.:
391.4414
SMILES:
Cc1ccn2c(nnc2c1)-c1ccc2cccc(OC3CCNCCC3F)c2n1
: