Target
Serine/threonine-protein kinase pim-1
Ligand
BDBM104225
Substrate
Meas. Tech.
PIM-1 Enzyme Assay
pH
7.4±0
Temperature
295.15±0 K
IC50
4.9±0.0 nM
Citation
 Allen, SCeleste, LLDavis, TGDeLisle, RKGreschuk, JMGross, SDHicken, EJJackson, LJKallan, NCLyssikatos, JPMarmsater, FPMunson, MCPheneger, JRast, BRobinson, JESchlachter, STTopalov, GTWright, ADZhao, Q Triazolopyridine compounds as PIM kinase inhibitors US Patent  US8575145 Publication Date 11/5/2013 
Target
Name:
Serine/threonine-protein kinase pim-1
Synonyms:
PIM-1 Kinase PIM1_HUMAN Serine/threonine-protein kinase (PIM1) Serine/threonine-protein kinase PIM1 | Serine/threonine-protein kinase pim-1 (PIM1)
Type:
Protein
Mol. Mass.:
35681.82
Organism:
Homo sapiens (Human)
Description:
P11309
Residue:
313
  
Inhibitor
Name:
BDBM104225
Synonyms:
US8575145, 102
Type:
Small organic molecule
Emp. Form.:
C21H19F2N5O
Mol. Mass.:
395.4053
SMILES:
FC1CCNCCC1Oc1cccc2ccc(nc12)-c1nnc2ccc(F)cn12
: