Target
Serine/threonine-protein kinase pim-2
Ligand
BDBM104201
Substrate
Meas. Tech.
PIM-2 Enzyme Assay
pH
7.4±0
Temperature
295.15±0 K
IC50
1278±0.0 nM
Citation
 Allen, SCeleste, LLDavis, TGDeLisle, RKGreschuk, JMGross, SDHicken, EJJackson, LJKallan, NCLyssikatos, JPMarmsater, FPMunson, MCPheneger, JRast, BRobinson, JESchlachter, STTopalov, GTWright, ADZhao, Q Triazolopyridine compounds as PIM kinase inhibitors US Patent  US8575145 Publication Date 11/5/2013 
Target
Name:
Serine/threonine-protein kinase pim-2
Synonyms:
PIM2 Pim-2h Serine/threonine-protein kinase PIM | Serine/threonine-protein kinase pim-2 (PIM2)
Type:
Serine/threonine-protein kinase
Mol. Mass.:
34185.93
Organism:
Homo sapiens (Human)
Description:
Q9P1W9
Residue:
311
  
Inhibitor
Name:
BDBM104201
Synonyms:
US8575145, 78
Type:
Small organic molecule
Emp. Form.:
C20H17BrFN5O
Mol. Mass.:
442.284
SMILES:
FC1CNCCC1Oc1cccc2ccc(nc12)-c1nnc2ccc(Br)cn12
: