Target
Epidermal growth factor receptor
Ligand
BDBM4274
Substrate
Poly(GAT)
Meas. Tech.
EGFR assay
pH
7.6±n/a
Temperature
295.15±n/a K
IC50
532000±n/a nM
Citation
 Gazit, AOsherov, NPosner, IYaish, PPoradosu, EGilon, CLevitzki, A Tyrphostins. 2. Heterocyclic and alpha-substituted benzylidenemalononitrile tyrphostins as potent inhibitors of EGF receptor and ErbB2/neu tyrosine kinases. J Med Chem 34:1896-907 (1991)  
Target
Name:
Epidermal growth factor receptor
Synonyms:
EGF Receptor Substrate EGFR_HUMAN ERBB1 Epidermal Growth Factor Receptor erbB-1 Epidermal growth factor receptor (EGFR) HER1 Proto-oncogene c-ErbB-1 Tyrosine-Protein Kinase ErbB-1
Type:
Receptor Kinase Domain
Mol. Mass.:
134279.59
Organism:
Homo sapiens (Human)
Description:
P00533
Residue:
1210
  
Inhibitor
Name:
BDBM4274
Synonyms:
2-(1H-imidazol-2-ylmethylidene)propanedinitrile | Tyrphostin deriv. 4
Type:
Small organic molecule
Emp. Form.:
C7H4N4
Mol. Mass.:
144.1335
SMILES:
N#CC(=Cc1ncc[nH]1)C#N
:
Substrate
Name:
Poly(GAT)
Synonyms:
Type:
Peptide
Mol. Mass.:
358.43
Organism:
Description:
poly(Glu6Ala3Tyr). 125 uM [gamma-32P]ATP as co-substrate.
Residue:
3
NA