Target
Epidermal growth factor receptor
Ligand
BDBM4288
Substrate
Poly(GAT)
Meas. Tech.
EGFR assay
IC50
26000±n/a nM
Citation
 Gazit, AOsherov, NPosner, IYaish, PPoradosu, EGilon, CLevitzki, A Tyrphostins. 2. Heterocyclic and alpha-substituted benzylidenemalononitrile tyrphostins as potent inhibitors of EGF receptor and ErbB2/neu tyrosine kinases. J Med Chem 34:1896-907 (1991)  
Target
Name:
Epidermal growth factor receptor
Synonyms:
EGF Receptor Substrate EGFR_HUMAN ERBB1 Epidermal Growth Factor Receptor erbB-1 Epidermal growth factor receptor (EGFR) HER1 Proto-oncogene c-ErbB-1 Tyrosine-Protein Kinase ErbB-1
Type:
Receptor Kinase Domain
Mol. Mass.:
134279.59
Organism:
Homo sapiens (Human)
Description:
P00533
Residue:
1210
  
Inhibitor
Name:
BDBM4288
Synonyms:
(N-Methyl-5-hydroxy-2-oxo-3-indolinidene)malononitrile Tyrphostin deriv. 19
Type:
Small organic molecule
Emp. Form.:
C12H7N3O2
Mol. Mass.:
225.2029
SMILES:
[#6]-[#7]-1-[#6](=O)\[#6](=[#6](\C#N)C#N)-c2cc(-[#8])ccc-12
:
Substrate
Name:
Poly(GAT)
Synonyms:
Type:
Peptide
Mol. Mass.:
358.43
Organism:
Description:
poly(Glu6Ala3Tyr). 125 uM [gamma-32P]ATP as co-substrate.
Residue:
3
NA