Target
Epidermal growth factor receptor
Ligand
BDBM4303
Substrate
Poly(GAT)
Meas. Tech.
EGFR assay
IC50
700±n/a nM
Citation
 Gazit, AOsherov, NPosner, IYaish, PPoradosu, EGilon, CLevitzki, A Tyrphostins. 2. Heterocyclic and alpha-substituted benzylidenemalononitrile tyrphostins as potent inhibitors of EGF receptor and ErbB2/neu tyrosine kinases. J Med Chem 34:1896-907 (1991)  
Target
Name:
Epidermal growth factor receptor
Synonyms:
EGF Receptor Substrate EGFR_HUMAN ERBB1 Epidermal Growth Factor Receptor erbB-1 Epidermal growth factor receptor (EGFR) HER1 Proto-oncogene c-ErbB-1 Tyrosine-Protein Kinase ErbB-1
Type:
Receptor Kinase Domain
Mol. Mass.:
134279.59
Organism:
Homo sapiens (Human)
Description:
P00533
Residue:
1210
  
Inhibitor
Name:
BDBM4303
Synonyms:
(2E)-2-cyano-3-(3,4-dihydroxyphenyl)-N-(3-phenylpropyl)prop-2-enamide (E)-2-cyano-3-(3,4-dihydroxyphenyl)-N-(3-phenylpropyl)acrylamide (E)-3-[3,4-bis(oxidanyl)phenyl]-2-cyano-N-(3-phenylpropyl)prop-2-enamide MLS000069704 TYRPHOSTIN AG 555 cid_5328770
Type:
Small organic molecule
Emp. Form.:
C19H18N2O3
Mol. Mass.:
322.3578
SMILES:
Oc1ccc(\C=C(/C#N)C(=O)NCCCc2ccccc2)cc1O
:
Substrate
Name:
Poly(GAT)
Synonyms:
Type:
Peptide
Mol. Mass.:
358.43
Organism:
Description:
poly(Glu6Ala3Tyr). 125 uM [gamma-32P]ATP as co-substrate.
Residue:
3
NA