Target
Polyunsaturated fatty acid lipoxygenase ALOX15
Ligand
BDBM106774
Substrate
Meas. Tech.
IC50 Assay
pH
7.5±0
Temperature
296.15±0 K
IC50
>1.00e+5±n/a nM
Citation
 Mascayano, CEspinosa, VSepúlveda-Boza, SSepúlveda-Boza, EKPerry, S In vitro study of isoflavones and isoflavans as potent inhibitors of human 12- and 15-lipoxygenases. Chem Biol Drug Des 82:317-25 (2013)  
Target
Name:
Polyunsaturated fatty acid lipoxygenase ALOX15
Synonyms:
15-Lipoxygenase-1 (15-LOX-1) Arachidonate 15-lipoxygenase LOG15 Reticulocyte 15-lipoxygenase-1 | Sphingosine 1-phosphate receptor 1 (S1P1)
Type:
Protein
Mol. Mass.:
74804.05
Organism:
Homo sapiens (Human)
Description:
Residue:
662
  
Inhibitor
Name:
BDBM106774
Synonyms:
3‐(4‐chlorophenyl)‐6,7‐dihydroxy‐4H‐chromen‐4‐one IR-5
Type:
Small organic molecule
Emp. Form.:
C15H9ClO4
Mol. Mass.:
288.683
SMILES:
Oc1cc2occ(-c3ccc(Cl)cc3)c(=O)c2cc1O
: