Target
Epidermal growth factor receptor
Ligand
BDBM4380
Substrate
Poly(GAT)
Meas. Tech.
EGFR assay
Ki
24000±n/a nM
IC50
75000±n/a nM
Citation
 Gazit, AYaish, PGilon, CLevitzki, A Tyrphostins I: synthesis and biological activity of protein tyrosine kinase inhibitors. J Med Chem 32:2344-52 (1989)  
Target
Name:
Epidermal growth factor receptor
Synonyms:
EGF Receptor Substrate EGFR_HUMAN ERBB1 Epidermal Growth Factor Receptor erbB-1 Epidermal growth factor receptor (EGFR) HER1 Proto-oncogene c-ErbB-1 Tyrosine-Protein Kinase ErbB-1
Type:
Receptor Kinase Domain
Mol. Mass.:
134279.59
Organism:
Homo sapiens (Human)
Description:
P00533
Residue:
1210
  
Inhibitor
Name:
BDBM4380
Synonyms:
(2Z)-2-cyano-3-(2,5-dihydroxyphenyl)prop-2-enoic acid | benzylidenemalononitrile (BMN) deriv. 65
Type:
Small organic molecule
Emp. Form.:
C10H7NO4
Mol. Mass.:
205.1669
SMILES:
OC(=O)C(=C/c1cc(O)ccc1O)\C#N
:
Substrate
Name:
Poly(GAT)
Synonyms:
Type:
Peptide
Mol. Mass.:
358.43
Organism:
Description:
poly(Glu6Ala3Tyr). 125 uM [gamma-32P]ATP as co-substrate.
Residue:
3
NA