Target
ALK tyrosine kinase receptor
Ligand
BDBM107030
Substrate
Meas. Tech.
Enzyme Assay
IC50
77±n/a nM
Citation
 Chen, BJiang, TMarsilje, THMichellys, PNguyen, TNPei, WWu, BGao, ZGe, YHuang, CLi, YZhu, X Compounds and compositions as protein kinase inhibitors US Patent  US8592432 Publication Date 11/26/2013 
Target
Name:
ALK tyrosine kinase receptor
Synonyms:
ALK ALK_HUMAN CD_antigen: CD246
Type:
Protein
Mol. Mass.:
176453.10
Organism:
Homo sapiens (Human)
Description:
Q9UM73
Residue:
1620
  
Inhibitor
Name:
BDBM107030
Synonyms:
US8592432, 3
Type:
Small organic molecule
Emp. Form.:
C30H37ClF2N6O4S
Mol. Mass.:
651.167
SMILES:
CC(C)Oc1cc(C2CCN(CC2)C(=O)CN(C)C)c(C)cc1Nc1ncc(Cl)c(Nc2ccccc2S(=O)(=O)C(F)F)n1
: