Target
ALK tyrosine kinase receptor
Ligand
BDBM107075
Substrate
Meas. Tech.
Enzyme Assay
IC50
10±n/a nM
Citation
 Chen, BJiang, TMarsilje, THMichellys, PNguyen, TNPei, WWu, BGao, ZGe, YHuang, CLi, YZhu, X Compounds and compositions as protein kinase inhibitors US Patent  US8592432 Publication Date 11/26/2013 
Target
Name:
ALK tyrosine kinase receptor
Synonyms:
ALK ALK_HUMAN CD_antigen: CD246
Type:
Protein
Mol. Mass.:
176453.10
Organism:
Homo sapiens (Human)
Description:
Q9UM73
Residue:
1620
  
Inhibitor
Name:
BDBM107075
Synonyms:
US8592432, 61
Type:
Small organic molecule
Emp. Form.:
C27H33N7O2S
Mol. Mass.:
519.662
SMILES:
CCN1CCC(C1)c1ccc(Nc2nc(Nc3ccccc3S(=O)(=O)C(C)C)c3c(C)[nH]nc3n2)cc1
: