Target
Acetyl-coenzyme A transporter 1
Ligand
BDBM107349
Substrate
Meas. Tech.
Binding Assay
pH
7.4±0
IC50
1.4±0.0 nM
Citation
 Maekawa, TIgawa, H Fused ring compound and use thereof US Patent  US8592431 Publication Date 11/26/2013 
Target
Name:
Acetyl-coenzyme A transporter 1
Synonyms:
ACATN AT1 SLC33A1
Type:
Enzyme
Mol. Mass.:
60911.27
Organism:
Homo sapiens (Human)
Description:
O00400
Residue:
549
  
Inhibitor
Name:
BDBM107349
Synonyms:
US8592431, 137
Type:
Small organic molecule
Emp. Form.:
C32H36N6O4
Mol. Mass.:
568.666
SMILES:
CCCCc1c(Cc2ccc(cc2)-c2ccccc2-c2nc(=O)o[nH]2)c(=O)n(C2CCOC(C)(C)C2)c2nc(C)nn12
: