Target
Acetyl-coenzyme A transporter 1
Ligand
BDBM107370
Substrate
Meas. Tech.
Binding Assay
pH
7.4±0
IC50
1.7±0.0 nM
Citation
 Maekawa, TIgawa, H Fused ring compound and use thereof US Patent  US8592431 Publication Date 11/26/2013 
Target
Name:
Acetyl-coenzyme A transporter 1
Synonyms:
ACATN AT1 SLC33A1
Type:
Enzyme
Mol. Mass.:
60911.27
Organism:
Homo sapiens (Human)
Description:
O00400
Residue:
549
  
Inhibitor
Name:
BDBM107370
Synonyms:
US8592431, 173
Type:
Small organic molecule
Emp. Form.:
C32H32N8O4
Mol. Mass.:
592.6477
SMILES:
CCCc1c(Cc2ccc(cc2)-c2ccccc2-c2nc(=O)o[nH]2)c(=O)n([C@H]2CC[C@@H](CC2)c2nnc(C)o2)c2ncnn12
: