Target
Prunasin hydrolase
Ligand
BDBM108218
Substrate
Meas. Tech.
Inhibition Assay Against Commercial Glycosidases
pH
10.6±n/a
Temperature
310.15±n/a K
IC50
117±n/a nM
Comments
extracted
Citation
 Li, ZLi, TDai, SXie, XMa, XZhao, WZhang, WLi, JWang, PG New insights into the pharmacological chaperone activity of c2-substituted glucoimidazoles for the treatment of Gaucher disease. Chembiochem 14:1239-47 (2013)  
Target
Name:
Prunasin hydrolase
Synonyms:
β-glucosidase | Prunasin hydrolase
Type:
Protein
Mol. Mass.:
61905.54
Organism:
Prunus dulcis (Almond)
Description:
Residue:
544
  
Inhibitor
Name:
BDBM108218
Synonyms:
5-(hydroxymethyl)-2-octyl-5H,6H,7H,8H-imidazo[1,2- a]pyridine-6,7,8-triol (Compound 4)
Type:
Small organic molecule
Emp. Form.:
C16H28N2O4
Mol. Mass.:
312.4045
SMILES:
CCCCCCCCc1cn2C(CO)C(O)C(O)C(O)c2n1
: