Target
Trace amine-associated receptor 1
Ligand
BDBM109349
Substrate
Meas. Tech.
Radioligand Binding Assay
Ki
2.1±n/a nM
Citation
 Galley, GGroebke Zbinden, KNorcross, RStalder, H 2-aminooxazolines as TAAR1 ligands US Patent  US8604061 Publication Date 12/10/2013 
Target
Name:
Trace amine-associated receptor 1
Synonyms:
TAAR1_MOUSE Taar1 Trace amine receptor 1 (TARR1) Trace amine-associated receptor1 | Trar1
Type:
Protein
Mol. Mass.:
37635.41
Organism:
Mus musculus (Mouse)
Description:
Q923Y8
Residue:
332
  
Inhibitor
Name:
BDBM109349
Synonyms:
US8604061, 5
Type:
Small organic molecule
Emp. Form.:
C9H9ClN2O
Mol. Mass.:
196.634
SMILES:
NC1=NC(CO1)c1ccc(Cl)cc1
: