Target
Trace amine-associated receptor 1
Ligand
BDBM109516
Substrate
Meas. Tech.
Radioligand Binding Assay
Ki
1.1±n/a nM
Citation
 Galley, GGroebke Zbinden, KNorcross, RStalder, H 2-aminooxazolines as TAAR1 ligands US Patent  US8604061 Publication Date 12/10/2013 
Target
Name:
Trace amine-associated receptor 1
Synonyms:
TAAR1_MOUSE Taar1 Trace amine receptor 1 (TARR1) Trace amine-associated receptor1 | Trar1
Type:
Protein
Mol. Mass.:
37635.41
Organism:
Mus musculus (Mouse)
Description:
Q923Y8
Residue:
332
  
Inhibitor
Name:
BDBM109516
Synonyms:
US8604061, 274
Type:
Small organic molecule
Emp. Form.:
C11H12ClFN2O
Mol. Mass.:
242.677
SMILES:
Cc1cc(c(F)cc1Cl)C1(C)COC(N)=N1
: