Target
Trace amine-associated receptor 1
Ligand
BDBM109518
Substrate
Meas. Tech.
Radioligand Binding Assay
Ki
1.9±n/a nM
Citation
 Galley, GGroebke Zbinden, KNorcross, RStalder, H 2-aminooxazolines as TAAR1 ligands US Patent  US8604061 Publication Date 12/10/2013 
Target
Name:
Trace amine-associated receptor 1
Synonyms:
TAAR1_RAT Taar1 Trace amine receptor 1 (TARR1) Trace amine-associated receptor 1 (TAAR1) Trar1
Type:
Enzyme
Mol. Mass.:
38034.73
Organism:
Rattus norvegicus (Rat)
Description:
Q923Y9
Residue:
332
  
Inhibitor
Name:
BDBM109518
Synonyms:
US8604061, 281
Type:
Small organic molecule
Emp. Form.:
C11H13ClN2O
Mol. Mass.:
224.687
SMILES:
Cc1cc(ccc1Cl)[C@@]1(C)COC(N)=N1
: