Target
Serine protease 1
Ligand
BDBM109622
Substrate
Meas. Tech.
Inhibition Assay
Ki
0.22±0.0 nM
Citation
 Konishi, ATokumasu, MSuzuki, TKoshiba, TOhsumi, KIkehara, OKodama, Y Heteroarylcarboxylic acid ester derivative US Patent  US8609715 Publication Date 12/17/2013 
Target
Name:
Serine protease 1
Synonyms:
Alpha-trypsin chain 1 Beta-trypsin PRSS1 TRP1 TRY1_HUMAN Thrombin & trypsin Trypsin I | Trypsin-1
Type:
Enzyme
Mol. Mass.:
26557.80
Organism:
Homo sapiens (Human)
Description:
P07477
Residue:
247
  
Inhibitor
Name:
BDBM109622
Synonyms:
US8609715, B-8
Type:
Small organic molecule
Emp. Form.:
C16H13N3O6S
Mol. Mass.:
375.356
SMILES:
C\C(=C/c1ccc(s1)C(=O)Oc1ccc(cc1[N+]([O-])=O)C(N)=N)C(O)=O
: