Target
Melanin-concentrating hormone receptor 1
Ligand
BDBM109824
Substrate
Meas. Tech.
Binding Assay
Ki
19±0.0 nM
Citation
 Guzzo, PRSurman, MDHenderson, AJJiang, MX Azinone-substituted azapolycycle MCH-1 antagonists, methods of making, and use thereof US Patent  US8618299 Publication Date 12/31/2013 
Target
Name:
Melanin-concentrating hormone receptor 1
Synonyms:
G-protein coupled receptor 24 MCH receptor 1 MCH-R1 MCHR-1 MCHR1_HUMAN Melanin-Concentrating Hormone Receptor 1 (MCH1R) Melanin-concentrating hormone receptor 1 (MCH-1) Melanin-concentrating hormone receptor 1 (MCHR-1) SLC-1 Somatostatin receptor-like protein
Type:
G Protein-Coupled Receptor (GPCR)
Mol. Mass.:
45976.27
Organism:
Homo sapiens (Human)
Description:
Membranes from CHO-K1 cells stably expressing human MCH1R were used in assays.
Residue:
422
  
Inhibitor
Name:
BDBM109824
Synonyms:
US8618299, 42
Type:
Small organic molecule
Emp. Form.:
C26H23ClFN3O2
Mol. Mass.:
463.931
SMILES:
Fc1cc(Cl)ccc1COc1ccn(-c2ccc3c4CN5CCCC5Cc4[nH]c3c2)c(=O)c1
: