Target
Heat shock protein HSP 90-alpha
Ligand
BDBM110224
Substrate
Meas. Tech.
Fluorescence Polarization Assay
pH
7.3±0
IC50
10±0 nM
Citation
 Lawson, JDCo, EWStafford, JA HSP90 inhibitors US Patent  US8618290 Publication Date 12/31/2013 
Target
Name:
Heat shock protein HSP 90-alpha
Synonyms:
HS90A_HUMAN HSP86 HSP90AA1 HSPCA Heat shock 86 kDa Heat shock protein HSP 90-alpha (HSP90) LAP-2 Lipopolysaccharide-associated protein 2 heat shock protein 90kDa alpha (cytosolic), class A member 1 isoform 2
Type:
Molecular Chaperone
Mol. Mass.:
84623.45
Organism:
Homo sapiens (Human)
Description:
P07900
Residue:
732
  
Inhibitor
Name:
BDBM110224
Synonyms:
US8618290, 65
Type:
Small organic molecule
Emp. Form.:
C27H31FN6O3
Mol. Mass.:
506.5718
SMILES:
COc1cccc(n1)-c1cc(F)ccc1[C@H]1Cc2nc(N)nc(C)c2C(NOCC2CC[C@H](O)CC2)=N1
: