Target
3-phosphoinositide-dependent protein kinase 1 [51-359]
Ligand
BDBM281993
Substrate
Meas. Tech.
PDK1 kinase assay
IC50
550±n/a nM
Citation
 Arndt, JChan, TGuckian, KKumaravel, GLee, WLin, EYScott, DSun, LThomas, Jvan Vloten, KWang, DZhang, LErlanson, D Heterocyclic compounds useful as PDK1 inhibitors US Patent  US10030016 Publication Date 7/24/2018 
Target
Name:
3-phosphoinositide-dependent protein kinase 1 [51-359]
Synonyms:
3-Phosphoinositide-Dependent Protein Kinase 1 (PDK1) 3-phosphoinositide-dependent protein kinase 1 (aa 51-359) PDK1 (aa 51-359) PDPK1_HUMAN | hPDK1
Type:
Enzyme Catalytic Domain
Mol. Mass.:
35302.26
Organism:
Homo sapiens (Human)
Description:
O15530[51-359]
Residue:
309
  
Inhibitor
Name:
BDBM281993
Synonyms:
4-({[5-(4-aminoquinazolin- 6-yl)thiophen-2-yl]methyl} amino)-2-(3,4- difluorobenzyl)-1,2-dihydro- 3H-pyrrole[3,4-c]pyridin- 3-one | US10030016, Example 7.19
Type:
Small organic molecule
Emp. Form.:
C27H20F2N6OS
Mol. Mass.:
514.549
SMILES:
Nc1ncnc2ccc(cc12)-c1ccc(CNc2nccc3CN(Cc4ccc(F)c(F)c4)C(=O)c23)s1
: