Target
Mu-type opioid receptor
Ligand
BDBM8961
Substrate
Meas. Tech.
Late stage Counterscreen for the probe development effort to identify agonists of the mouse 5-hydroxytryptamine (serotonin) receptor 2A (HTR2A)
EC50
92470±n/a nM
Citation
 PubChem, PC Late stage Counterscreen for the probe development effort to identify agonists of the mouse 5-hydroxytryptamine (serotonin) receptor 2A (HTR2A): Luminescence-based cell-based high throughput dose response assay to identify agonists of the mu 1 opioid receptor (OPRM1) PubChem Bioassay (2013)[AID] 
Target
Name:
Mu-type opioid receptor
Synonyms:
M-OR-1 MOR-1 MUOR1 Mu opiate receptor OPRM1 hMOP | mu-type opioid receptor isoform MOR-1
Type:
G Protein-Coupled Receptor (GPCR)
Mol. Mass.:
44789.51
Organism:
Homo sapiens (Human)
Description:
P35372
Residue:
400
  
Inhibitor
Name:
BDBM8961
Synonyms:
1,2,3,4-tetrahydro-9-acridinamine 9-THA CHEMBL1337960 Cognex Tracine cid_1935 | tacrine.HCl
Type:
Small organic molecule
Emp. Form.:
C13H14N2
Mol. Mass.:
198.2637
SMILES:
Nc1c2CCCCc2nc2ccccc12
: