Target
5-hydroxytryptamine receptor 2A
Ligand
BDBM8961
Substrate
Meas. Tech.
Late stage for the probe development effort to identify agonists of the mouse 5-hydroxytryptamine (serotonin) receptor 2A (HTR2A)
EC50
76083±n/a nM
Citation
 PubChem, PC Late stage for the probe development effort to identify agonists of the mouse 5-hydroxytryptamine (serotonin) receptor 2A (HTR2A): Luminescence-based cell-based high throughput dose response assay for agonists of the mouse 5-hydroxytryptamine (serotonin) receptor 2A (HTR2A) PubChem Bioassay (2013)[AID] 
Target
Name:
5-hydroxytryptamine receptor 2A
Synonyms:
5-HT-2 5-hydroxytryptamine receptor 2A 5HT2A_MOUSE Htr2 Serotonin 2a (5-HT2a) receptor
Type:
Enzyme
Mol. Mass.:
52843.00
Organism:
Mus musculus (Mouse)
Description:
P35363
Residue:
471
  
Inhibitor
Name:
BDBM8961
Synonyms:
1,2,3,4-tetrahydro-9-acridinamine 9-THA CHEMBL1337960 Cognex Tracine cid_1935 | tacrine.HCl
Type:
Small organic molecule
Emp. Form.:
C13H14N2
Mol. Mass.:
198.2637
SMILES:
Nc1c2CCCCc2nc2ccccc12
: