Target
Methyl-CpG-binding domain protein 2
Ligand
BDBM79562
Substrate
Meas. Tech.
TRFRET-based biochemical high throughput dose response assay to identify inhibitors of 5-meCpG-binding domain protein 2 (MBD2)-DBD binding to methylated oligonucleotide
IC50
6920±n/a nM
Citation
 PubChem, PC TRFRET-based biochemical high throughput dose response assay to identify inhibitors of 5-meCpG-binding domain protein 2 (MBD2)-DBD binding to methylated oligonucleotide PubChem Bioassay (2013)[AID] 
Target
Name:
Methyl-CpG-binding domain protein 2
Synonyms:
MBD2 Methyl-CpG binding domain protein 2 | Methyl-CpG-binding domain protein 2 (MBD2)
Type:
Enzyme Catalytic Domain
Mol. Mass.:
43278.74
Organism:
Homo sapiens (Human)
Description:
gi_21595776
Residue:
411
  
Inhibitor
Name:
BDBM79562
Synonyms:
1,2,4,6-tetraphenylpyridin-1-ium;perchlorate SMR000285849 | cid_12477066
Type:
Small organic molecule
Emp. Form.:
C29H22N
Mol. Mass.:
384.4911
SMILES:
c1ccc(cc1)-c1cc(-c2ccccc2)[n+](-c2ccccc2)c(c1)-c1ccccc1
: